Reaction Details
TargetAdenosine receptor A2a
LigandBDBM50584559
Substrate/Competitorn/a
Meas. Tech.ChEMBL_2160170 (CHEMBL5044920)
Ki 1.7±n/a nM
Citation Val, CRodríguez-García, CPrieto-Díaz, RCrespo, AAzuaje, JCarbajales, CMajellaro, MDíaz-Holguín, ABrea, JMLoza, MIGioé-Gallo, CContino, MStefanachi, AGarcía-Mera, XEstévez, JCGutiérrez-de-Terán, HSotelo, E Optimization of 2-Amino-4,6-diarylpyrimidine-5-carbonitriles as Potent and Selective A J Med Chem65:2091-2106 (2022) 
 
Adenosine receptor A2a
Name:Adenosine receptor A2a
Type:G Protein-Coupled Receptor (GPCR)
Mol. Mass.:44716.46
Organism:Homo sapiens (Human)
Description:P29274
Residue:412
BDBM50584559
NameBDBM50584559
Synonyms:CHEMBL5088876
TypeSmall organic molecule
Emp. Form.C19H16N4O2
Mol. Mass.332.3559
SMILESCOc1cc(OC)cc(c1)-c1nc(N)nc(-c2ccccc2)c1C#N