Reaction Details
TargetAdenosine receptor A2a
LigandBDBM21173
Substrate/Competitorn/a
Meas. Tech.ChEMBL_2160170 (CHEMBL5044920)
Ki 157±n/a nM
Citation Val, CRodríguez-García, CPrieto-Díaz, RCrespo, AAzuaje, JCarbajales, CMajellaro, MDíaz-Holguín, ABrea, JMLoza, MIGioé-Gallo, CContino, MStefanachi, AGarcía-Mera, XEstévez, JCGutiérrez-de-Terán, HSotelo, E Optimization of 2-Amino-4,6-diarylpyrimidine-5-carbonitriles as Potent and Selective A J Med Chem65:2091-2106 (2022) 
 
Adenosine receptor A2a
Name:Adenosine receptor A2a
Type:G Protein-Coupled Receptor (GPCR)
Mol. Mass.:44716.46
Organism:Homo sapiens (Human)
Description:P29274
Residue:412
BDBM21173
NameBDBM21173
Synonyms:1,3-dipropyl-8-cyclopentylxanthine CHEMBL183 PD116948 | [3H]DPCPX
Typeradiolabeled ligand
Emp. Form.C16H24N4O2
Mol. Mass.304.3874
SMILESCCCn1c2nc([nH]c2c(=O)n(CCC)c1=O)C1CCCC1