Reaction Details
TargetATP-binding cassette sub-family C member 8
LigandBDBM50153520
Substrate/Competitorn/a
Meas. Tech.ChEMBL_306731 (CHEMBL832318)
IC50 106±n/a nM
Citation Wängler, BBeck, CShiue, CYSchneider, SSchwanstecher, CSchwanstecher, MFeilen, PJAlavi, ARösch, FSchirrmacher, R Synthesis and in vitro evaluation of (S)-2-([11C]methoxy)-4-[3-methyl-1-(2-piperidine-1-yl-phenyl)-butyl-carbamoyl]-benzoic acid ([11C]methoxy-repaglinide): a potential beta-cell imaging agent. Bioorg Med Chem Lett14:5205-9 (2004) 
 
ATP-binding cassette sub-family C member 8
Name:ATP-binding cassette sub-family C member 8
Type:PROTEIN
Mol. Mass.:177013.37
Organism:Homo sapiens (Human)
Description:ChEMBL_1436733
Residue:1581
BDBM50153520
NameBDBM50153520
Synonyms:(S)-2-ethoxy-4-(2-(3-methyl-1-(2-(piperidin-1-yl)phenyl)butylamino)-2-oxoethyl)benzoic acid AGEE-623ZW Prandin | REPAGLINIDE
TypeSmall organic molecule
Emp. Form.C27H36N2O4
Mol. Mass.452.5857
SMILESCCOc1cc(CC(=O)N[C@@H](CC(C)C)c2ccccc2N2CCCCC2)ccc1C(O)=O