Reaction Details
TargetSodium-dependent serotonin transporter
LigandBDBM50153621
Substrate/Competitorn/a
Meas. Tech.ChEMBL_302824 (CHEMBL839613)
Ki 0.38±n/a nM
Citation Gilbert, AMColeman, TKodah, JMewshaw, REScerni, RSchechter, LESmith, DLAndree, TH Novel aryloxy-8-azabicyclo[3.2.1]oct-3-enes with 5-HT transporter and 5-HT1A affinity. Bioorg Med Chem Lett14:5281-4 (2004) 
 
Sodium-dependent serotonin transporter
Name:Sodium-dependent serotonin transporter
Type:Multi-pass membrane protein
Mol. Mass.:70168.43
Organism:Rattus norvegicus (rat)
Description:P31652
Residue:630
BDBM50153621
NameBDBM50153621
Synonyms:(S)-1-[3-(3,4-Dichloro-phenyl)-8-aza-bicyclo[3.2.1]oct-2-en-8-yl]-3-(1H-indol-4-yloxy)-propan-2-ol | CHEMBL441316
TypeSmall organic molecule
Emp. Form.C24H24Cl2N2O2
Mol. Mass.443.366
SMILESO[C@H](COc1cccc2[nH]ccc12)CN1C2CCC1C=C(C2)c1ccc(Cl)c(Cl)c1