Reaction Details
TargetC-C chemokine receptor type 2
LigandBDBM50409950
Substrate/Competitorn/a
Meas. Tech.ChEMBL_310494 (CHEMBL834068)
EC50 810±n/a nM
Citation Moree, WJKataoka, KRamirez-Weinhouse, MMShiota, TImai, MSudo, MTsutsumi, TEndo, NMuroga, YHada, TTanaka, HMorita, TGreene, JBarnum, DSaunders, JKato, YMyers, PLTarby, CM Small molecule antagonists of the CCR2b receptor. Part 2: Discovery process and initial structure-activity relationships of diamine derivatives. Bioorg Med Chem Lett14:5413-6 (2004) 
 
C-C chemokine receptor type 2
Name:C-C chemokine receptor type 2
Type:Enzyme
Mol. Mass.:41932.32
Organism:Homo sapiens (Human)
Description:P41597
Residue:374
BDBM50409950
NameBDBM50409950
Synonyms:CHEMBL2096788
TypeSmall organic molecule
Emp. Form.C22H23ClF3N3O2
Mol. Mass.453.885
SMILESFC(F)(F)c1cccc(c1)C(=O)NCC(=O)NC[C@H]1CCCN1Cc1ccc(Cl)cc1