Reaction Details
TargetC-C chemokine receptor type 2
LigandBDBM50236430
Substrate/Competitorn/a
Meas. Tech.ChEMBL_310494 (CHEMBL834068)
EC50 20±n/a nM
Citation Moree, WJKataoka, KRamirez-Weinhouse, MMShiota, TImai, MSudo, MTsutsumi, TEndo, NMuroga, YHada, TTanaka, HMorita, TGreene, JBarnum, DSaunders, JKato, YMyers, PLTarby, CM Small molecule antagonists of the CCR2b receptor. Part 2: Discovery process and initial structure-activity relationships of diamine derivatives. Bioorg Med Chem Lett14:5413-6 (2004) 
 
C-C chemokine receptor type 2
Name:C-C chemokine receptor type 2
Type:Enzyme
Mol. Mass.:41932.32
Organism:Homo sapiens (Human)
Description:P41597
Residue:374
BDBM50236430
NameBDBM50236430
Synonyms:(R)-N-(2-(1-(4-chlorobenzyl)pyrrolidin-3-ylamino)-2-oxoethyl)-3-(trifluoromethyl)benzamide | CHEMBL255408
TypeSmall organic molecule
Emp. Form.C21H21ClF3N3O2
Mol. Mass.439.859
SMILESFC(F)(F)c1cccc(c1)C(=O)NCC(=O)N[C@@H]1CCN(Cc2ccc(Cl)cc2)C1