Reaction Details
TargetC-C chemokine receptor type 2
LigandBDBM50153942
Substrate/Competitorn/a
Meas. Tech.ChEMBL_310494 (CHEMBL834068)
EC50 40±n/a nM
Citation Moree, WJKataoka, KRamirez-Weinhouse, MMShiota, TImai, MSudo, MTsutsumi, TEndo, NMuroga, YHada, TTanaka, HMorita, TGreene, JBarnum, DSaunders, JKato, YMyers, PLTarby, CM Small molecule antagonists of the CCR2b receptor. Part 2: Discovery process and initial structure-activity relationships of diamine derivatives. Bioorg Med Chem Lett14:5413-6 (2004) 
 
C-C chemokine receptor type 2
Name:C-C chemokine receptor type 2
Type:Enzyme
Mol. Mass.:41932.32
Organism:Homo sapiens (Human)
Description:P41597
Residue:374
BDBM50153942
NameBDBM50153942
Synonyms:CHEMBL435499 | N-({[1-(4-Chloro-benzyl)-piperidin-4-ylmethyl]-carbamoyl}-methyl)-3-trifluoromethyl-benzamide
TypeSmall organic molecule
Emp. Form.C23H25ClF3N3O2
Mol. Mass.467.912
SMILESFC(F)(F)c1cccc(c1)C(=O)NCC(=O)NCC1CCN(Cc2ccc(Cl)cc2)CC1