Reaction Details
TargetEstrogen receptor beta
LigandBDBM50154047
Substrate/Competitorn/a
Meas. Tech.ChEMBL_306447 (CHEMBL829091)
IC50 3.7±n/a nM
Citation Malamas, MSManas, ESMcDevitt, REGunawan, IXu, ZBCollini, MDMiller, CPDinh, THenderson, RAKeith, JCHarris, HA Design and synthesis of aryl diphenolic azoles as potent and selective estrogen receptor-beta ligands. J Med Chem47:5021-40 (2004) 
 
Estrogen receptor beta
Name:Estrogen receptor beta
Type:Protein
Mol. Mass.:59238.43
Organism:Homo sapiens (Human)
Description:Q92731
Residue:530
BDBM50154047
NameBDBM50154047
Synonyms:2-(2,3-Difluoro-4-hydroxy-phenyl)-7-vinyl-benzooxazol-5-ol CHEMBL363963
TypeSmall organic molecule
Emp. Form.C15H9F2NO3
Mol. Mass.289.2337
SMILESOc1cc(C=C)c2oc(nc2c1)-c1ccc(O)c(F)c1F