Reaction Details
TargetEstrogen receptor
LigandBDBM50154084
Substrate/Competitorn/a
Meas. Tech.ChEMBL_306464 (CHEMBL829541)
IC50 199±n/a nM
Citation Malamas, MSManas, ESMcDevitt, REGunawan, IXu, ZBCollini, MDMiller, CPDinh, THenderson, RAKeith, JCHarris, HA Design and synthesis of aryl diphenolic azoles as potent and selective estrogen receptor-beta ligands. J Med Chem47:5021-40 (2004) 
 
Estrogen receptor
Name:Estrogen receptor
Type:PROTEIN
Mol. Mass.:66969.87
Organism:Mus musculus
Description:ChEMBL_648798
Residue:599
BDBM50154084
NameBDBM50154084
Synonyms:7-Bromo-2-(3-fluoro-4-hydroxy-phenyl)-benzooxazol-5-ol CHEMBL187207
TypeSmall organic molecule
Emp. Form.C13H7BrFNO3
Mol. Mass.324.102
SMILESOc1cc(Br)c2oc(nc2c1)-c1ccc(O)c(F)c1