Reaction Details
TargetEstrogen receptor beta
LigandBDBM20731
Substrate/Competitorn/a
Meas. Tech.ChEMBL_306447 (CHEMBL829091)
IC50 1.8±n/a nM
Citation Malamas, MSManas, ESMcDevitt, REGunawan, IXu, ZBCollini, MDMiller, CPDinh, THenderson, RAKeith, JCHarris, HA Design and synthesis of aryl diphenolic azoles as potent and selective estrogen receptor-beta ligands. J Med Chem47:5021-40 (2004) 
 
Estrogen receptor beta
Name:Estrogen receptor beta
Type:Protein
Mol. Mass.:59238.43
Organism:Homo sapiens (Human)
Description:Q92731
Residue:530
BDBM20731
NameBDBM20731
Synonyms:4-bromo-6-(6-hydroxy-1,2-benzoxazol-3-yl)benzene-1,3-diol CHEMBL361078
TypeSmall organic molecule
Emp. Form.C13H8BrNO4
Mol. Mass.322.111
SMILESOc1ccc2c(noc2c1)-c1cc(Br)c(O)cc1O