Reaction Details
TargetEstrogen receptor
LigandBDBM50154084
Substrate/Competitorn/a
Meas. Tech.ChEMBL_306463 (CHEMBL829540)
IC50 260±n/a nM
Citation Malamas, MSManas, ESMcDevitt, REGunawan, IXu, ZBCollini, MDMiller, CPDinh, THenderson, RAKeith, JCHarris, HA Design and synthesis of aryl diphenolic azoles as potent and selective estrogen receptor-beta ligands. J Med Chem47:5021-40 (2004) 
 
Estrogen receptor
Name:Estrogen receptor
Type:Protein
Mol. Mass.:66230.44
Organism:Homo sapiens (Human)
Description:P03372
Residue:595
BDBM50154084
NameBDBM50154084
Synonyms:7-Bromo-2-(3-fluoro-4-hydroxy-phenyl)-benzooxazol-5-ol CHEMBL187207
TypeSmall organic molecule
Emp. Form.C13H7BrFNO3
Mol. Mass.324.102
SMILESOc1cc(Br)c2oc(nc2c1)-c1ccc(O)c(F)c1