Reaction Details
TargetEstrogen receptor beta
LigandBDBM20734
Substrate/Competitorn/a
Meas. Tech.ChEMBL_306447 (CHEMBL829091)
IC50 2±n/a nM
Citation Malamas, MSManas, ESMcDevitt, REGunawan, IXu, ZBCollini, MDMiller, CPDinh, THenderson, RAKeith, JCHarris, HA Design and synthesis of aryl diphenolic azoles as potent and selective estrogen receptor-beta ligands. J Med Chem47:5021-40 (2004) 
 
Estrogen receptor beta
Name:Estrogen receptor beta
Type:Protein
Mol. Mass.:59238.43
Organism:Homo sapiens (Human)
Description:Q92731
Residue:530
BDBM20734
NameBDBM20734
Synonyms:4-chloro-6-(6-hydroxy-1,2-benzoxazol-3-yl)benzene-1,3-diol CHEMBL362307
TypeSmall organic molecule
Emp. Form.C13H8ClNO4
Mol. Mass.277.66
SMILESOc1ccc2c(noc2c1)-c1cc(Cl)c(O)cc1O