Reaction Details
TargetTyrosine-protein kinase HCK
LigandBDBM14322
Substrate/Competitorn/a
Meas. Tech.ChEMBL_304474 (CHEMBL832690)
EC50>1000000±n/a nM
Citation Inglis, SRStojkoski, CBranson, KMCawthray, JFFritz, DWiadrowski, EPyke, SMBooker, GW Identification and specificity studies of small-molecule ligands for SH3 protein domains. J Med Chem47:5405-17 (2004) 
 
Tyrosine-protein kinase HCK
Name:Tyrosine-protein kinase HCK
Type:Enzyme Catalytic Domain
Mol. Mass.:59600.18
Organism:Homo sapiens (Human)
Description:P08631
Residue:526
BDBM14322
NameBDBM14322
Synonyms:2-Aminoquinoline 1 CHEMBL61236 Quinolin-2-amine | fragment 2 (J. med. chem.,50,1116)
TypeSmall organic molecule
Emp. Form.C9H8N2
Mol. Mass.144.1732
SMILESNc1ccc2ccccc2n1