Reaction Details
TargetVascular endothelial growth factor receptor 2
LigandBDBM50155145
Substrate/Competitorn/a
Meas. Tech.ChEMBL_306585 (CHEMBL832932)
IC50 40010.0±n/a nM
Citation Cusack, KPArnold, LDBarberis, CEChen, HEricsson, AMGaza-Bulseco, GSGordon, TDGrinnell, CMHarsch, APellegrini, MTarcsa, E A 13C NMR approach to categorizing potential limitations of alpha,beta-unsaturated carbonyl systems in drug-like molecules. Bioorg Med Chem Lett14:5503-7 (2004) 
 
Vascular endothelial growth factor receptor 2
Name:Vascular endothelial growth factor receptor 2
Type:Receptor Tyrosine Kinase
Mol. Mass.:151510.97
Organism:Homo sapiens (Human)
Description:P35968
Residue:1356
BDBM50155145
NameBDBM50155145
Synonyms:4-(1H-Indol-2-ylmethylene)-5-pyrazin-2-yl-2,4-dihydro-pyrazol-3-one | CHEMBL359592
TypeSmall organic molecule
Emp. Form.C16H11N5O
Mol. Mass.289.2914
SMILESO=C1NN=C(\C1=C\c1cc2ccccc2[nH]1)c1cnccn1