Reaction Details
TargetVascular endothelial growth factor receptor 2
LigandBDBM50155144
Substrate/Competitorn/a
Meas. Tech.ChEMBL_306571 (CHEMBL832088)
IC50 20±n/a nM
Citation Cusack, KPArnold, LDBarberis, CEChen, HEricsson, AMGaza-Bulseco, GSGordon, TDGrinnell, CMHarsch, APellegrini, MTarcsa, E A 13C NMR approach to categorizing potential limitations of alpha,beta-unsaturated carbonyl systems in drug-like molecules. Bioorg Med Chem Lett14:5503-7 (2004) 
 
Vascular endothelial growth factor receptor 2
Name:Vascular endothelial growth factor receptor 2
Type:Receptor Tyrosine Kinase
Mol. Mass.:151510.97
Organism:Homo sapiens (Human)
Description:P35968
Residue:1356
BDBM50155144
NameBDBM50155144
Synonyms:4-(3-Phenyl-1H-indol-2-ylmethylene)-5-pyrazin-2-yl-2,4-dihydro-pyrazol-3-one | CHEMBL365064
TypeSmall organic molecule
Emp. Form.C22H15N5O
Mol. Mass.365.3874
SMILESO=C1NN=C(\C1=C\c1[nH]c2ccccc2c1-c1ccccc1)c1cnccn1