Reaction Details
TargetNeuronal acetylcholine receptor subunit alpha-4/beta-2
LigandBDBM50155636
Substrate/Competitorn/a
Meas. Tech.ChEMBL_303692 (CHEMBL829737)
Ki 14500±n/a nM
Citation Pallavicini, MMoroni, BBolchi, CClementi, FFumagalli, LGotti, CVailati, SValoti, EVilla, L Synthesis and alpha4beta2 nicotinic affinity of 2-pyrrolidinylmethoxyimines and prolinal oxime ethers. Bioorg Med Chem Lett14:5827-30 (2004) 
 
Neuronal acetylcholine receptor subunit alpha-4/beta-2
Name:Neuronal acetylcholine receptor subunit alpha-4/beta-2
Type:n/a
Mol. Mass.:n/a
Description:n/a
Components:This complex has 0 components.
Component 1
Name:Neuronal acetylcholine receptor subunit alpha-4
Synonyms:ACHA4_RAT Cholinergic, Nicotinic Alpha4Beta2 Chrna4 Neuronal acetylcholine receptor (alpha4beta2 nAChR) Neuronal acetylcholine receptor subunit alpha 4 beta 2 | Neuronal acetylcholine receptor subunit alpha-4
Type:Enzyme
Mol. Mass.:70196.44
Organism:Rattus norvegicus (Rat)
Description:P09483
Residue:630
Component 2
Name:Neuronal acetylcholine receptor subunit beta-2
Synonyms:ACHB2_RAT Chrnb2 Neuronal acetylcholine receptor non-alpha-1 chain
Type:Enzyme
Mol. Mass.:56910.32
Organism:Rattus norvegicus (Rat)
Description:P12390
Residue:500
BDBM50155636
NameBDBM50155636
Synonyms:(R)-1-Methyl-pyrrolidine-2-carbaldehyde O-isopropyl-oxime | CHEMBL412407
TypeSmall organic molecule
Emp. Form.C9H18N2O
Mol. Mass.170.252
SMILESCC(C)O\N=C/[C@H]1CCCN1C