Reaction Details
TargetIntegrin alpha-V/beta-3
LigandBDBM50155807
Substrate/Competitorn/a
Meas. Tech.ChEMBL_305552 (CHEMBL828571)
IC50 49±n/a nM
Citation Ghosh, SSantulli, RJKinney, WADecorte, BLLiu, LLewis, JMProost, JCLeo, GCMasucci, JHageman, WEThompson, ASChen, IKawahama, RTuman, RWGalemmo, RAJohnson, DLDamiano, BPMaryanoff, BE 1,2,3,4-Tetrahydroquinoline-containing alphaVbeta3 integrin antagonists with enhanced oral bioavailability. Bioorg Med Chem Lett14:5937-41 (2004) 
 
Integrin alpha-V/beta-3
Name:Integrin alpha-V/beta-3
Type:Enzyme
Mol. Mass.:n/a
Description:n/a
Components:This complex has 2 components.
Component 1
Name:Integrin alpha-V
Synonyms:ITAV_HUMAN Integrin alpha-V/alpha-5 VNRA Vitronectin receptor | Vitronectin receptor subunit alpha
Type:PROTEIN
Mol. Mass.:116024.92
Organism:Homo sapiens (Human)
Description:ChEMBL_582336
Residue:1048
Component 2
Name:Integrin beta-3
Synonyms:CD_antigen=CD61 GPIIIa ITGB3 Platelet membrane glycoprotein IIIa
Type:Protein
Mol. Mass.:87038.91
Organism:Homo sapiens (Human)
Description:P05106
Residue:788
BDBM50155807
NameBDBM50155807
Synonyms:3-(1-Methyl-1,2,3,4-tetrahydro-quinolin-3-yl)-4-[1-(3-5,6,7,8-tetrahydro-[1,8]naphthyridin-2-yl-propionyl)-piperidin-4-yl]-butyric acid | CHEMBL362114
TypeSmall organic molecule
Emp. Form.C30H40N4O3
Mol. Mass.504.6636
SMILESCN1CC(Cc2ccccc12)C(CC1CCN(CC1)C(=O)CCc1ccc2CCCNc2n1)CC(O)=O