Reaction Details
TargetIntegrin alpha-V/beta-5
LigandBDBM50155813
Substrate/Competitorn/a
Meas. Tech.ChEMBL_305553 (CHEMBL828572)
IC50 2.2±n/a nM
Citation Ghosh, SSantulli, RJKinney, WADecorte, BLLiu, LLewis, JMProost, JCLeo, GCMasucci, JHageman, WEThompson, ASChen, IKawahama, RTuman, RWGalemmo, RAJohnson, DLDamiano, BPMaryanoff, BE 1,2,3,4-Tetrahydroquinoline-containing alphaVbeta3 integrin antagonists with enhanced oral bioavailability. Bioorg Med Chem Lett14:5937-41 (2004) 
 
Integrin alpha-V/beta-5
Name:Integrin alpha-V/beta-5
Type:Enzyme
Mol. Mass.:n/a
Description:n/a
Components:This complex has 2 components.
Component 1
Name:Integrin alpha-V
Synonyms:ITAV_HUMAN Integrin alpha-V/alpha-5 VNRA Vitronectin receptor | Vitronectin receptor subunit alpha
Type:PROTEIN
Mol. Mass.:116024.92
Organism:Homo sapiens (Human)
Description:ChEMBL_582336
Residue:1048
Component 2
Name:Integrin beta-5
Synonyms:ITB5_HUMAN | ITGB5
Type:PROTEIN
Mol. Mass.:88047.37
Organism:Homo sapiens (Human)
Description:EBI_10915
Residue:799
BDBM50155813
NameBDBM50155813
Synonyms:(R)-3-Quinolin-3-yl-4-[1-(3-5,6,7,8-tetrahydro-[1,8]naphthyridin-2-yl-propionyl)-piperidin-4-yl]-butyric acid | CHEMBL186616
TypeSmall organic molecule
Emp. Form.C29H34N4O3
Mol. Mass.486.6053
SMILESOC(=O)C[C@@H](CC1CCN(CC1)C(=O)CCc1ccc2CCCNc2n1)c1cnc2ccccc2c1