Reaction Details
TargetCorticotropin-releasing factor receptor 1
LigandBDBM50155974
Substrate/Competitorn/a
Meas. Tech.ChEMBL_306679 (CHEMBL830013)
IC50 0.49±n/a nM
Citation Dzierba, CDTakvorian, AGRafalski, MKasireddy-Polam, PWong, HMolski, TFZhang, GLi, YWLelas, SPeng, YMcElroy, JFZaczek, RCTaub, RACombs, APGilligan, PJTrainor, GL Synthesis, structure-activity relationships, and in vivo properties of 3,4-dihydro-1H-pyrido[2,3-b]pyrazin-2-ones as corticotropin-releasing factor-1 receptor antagonists. J Med Chem47:5783-90 (2004) 
 
Corticotropin-releasing factor receptor 1
Name:Corticotropin-releasing factor receptor 1
Type:G Protein-Coupled Receptor (GPCR)
Mol. Mass.:47870.75
Organism:Rattus norvegicus (rat)
Description:Receptor binding assays were performed using rat cortex homogenate.
Residue:415
BDBM50155974
NameBDBM50155974
Synonyms:8-(Butyl-ethyl-amino)-4-(2,4-dichloro-phenyl)-6-methyl-3,4-dihydro-1H-pyrido[2,3-b]pyrazin-2-one | CHEMBL186203
TypeSmall organic molecule
Emp. Form.C20H24Cl2N4O
Mol. Mass.407.337
SMILESCCCCN(CC)c1cc(C)nc2N(CC(=O)Nc12)c1ccc(Cl)cc1Cl