Reaction Details
TargetCorticotropin-releasing factor receptor 1
LigandBDBM50155977
Substrate/Competitorn/a
Meas. Tech.ChEMBL_306679 (CHEMBL830013)
IC50 3.3±n/a nM
Citation Dzierba, CDTakvorian, AGRafalski, MKasireddy-Polam, PWong, HMolski, TFZhang, GLi, YWLelas, SPeng, YMcElroy, JFZaczek, RCTaub, RACombs, APGilligan, PJTrainor, GL Synthesis, structure-activity relationships, and in vivo properties of 3,4-dihydro-1H-pyrido[2,3-b]pyrazin-2-ones as corticotropin-releasing factor-1 receptor antagonists. J Med Chem47:5783-90 (2004) 
 
Corticotropin-releasing factor receptor 1
Name:Corticotropin-releasing factor receptor 1
Type:G Protein-Coupled Receptor (GPCR)
Mol. Mass.:47870.75
Organism:Rattus norvegicus (rat)
Description:Receptor binding assays were performed using rat cortex homogenate.
Residue:415
BDBM50155977
NameBDBM50155977
Synonyms:4-[8-(Butyl-ethyl-amino)-6-methyl-2-oxo-2,3-dihydro-1H-pyrido[2,3-b]pyrazin-4-yl]-3,5-dichloro-benzonitrile; TFA | CHEMBL187410
TypeSmall organic molecule
Emp. Form.C21H23Cl2N5O
Mol. Mass.432.346
SMILESCCCCN(CC)c1cc(C)nc2N(CC(=O)Nc12)c1c(Cl)cc(cc1Cl)C#N