Reaction Details
TargetBeta-secretase 1
LigandBDBM50156017
Substrate/Competitorn/a
Meas. Tech.ChEMBL_303269 (CHEMBL828263)
Ki 2.5±n/a nM
Citation Huang, DCaflisch, A Efficient evaluation of binding free energy using continuum electrostatics solvation. J Med Chem47:5791-7 (2004) 
 
Beta-secretase 1
Name:Beta-secretase 1
Type:Protein
Mol. Mass.:55755.10
Organism:Homo sapiens (Human)
Description:P56817
Residue:501
BDBM50156017
NameBDBM50156017
Synonyms:((S)-1-{1-[(S)-4-((S)-1-Benzylcarbamoyl-2-methyl-propylcarbamoyl)-2-hydroxy-1-isobutyl-pentylcarbamoyl]-3-methylsulfanyl-propylcarbamoyl}-2-methyl-propyl)-carbamic acid tert-butyl ester | CHEMBL187614
TypeSmall organic molecule
Emp. Form.C37H63N5O7S
Mol. Mass.721.99
SMILESCSCCC(NC(=O)[C@@H](NC(=O)OC(C)(C)C)C(C)C)C(=O)N[C@@H](CC(C)C)C(O)CC(C)C(=O)N[C@@H](C(C)C)C(=O)NCc1ccccc1