Reaction Details
TargetGag-Pol polyprotein [489-587]
LigandBDBM50156011
Substrate/Competitorn/a
Meas. Tech.ChEMBL_303547 (CHEMBL839752)
Ki 0.900000±n/a nM
Citation Huang, DCaflisch, A Efficient evaluation of binding free energy using continuum electrostatics solvation. J Med Chem47:5791-7 (2004) 
 
Gag-Pol polyprotein [489-587]
Name:Gag-Pol polyprotein [489-587]
Type:Enzyme Subunit
Mol. Mass.:10781.16
Organism:Human immunodeficiency virus type 1
Description:P04585[489-587]
Residue:99
BDBM50156011
NameBDBM50156011
Synonyms:2-{2-[(2R,4S)-5-(2-Benzyloxycarbonylamino-propionylamino)-4-hydroxy-2-isobutyl-6-phenyl-hexanoylamino]-3-methyl-butyrylamino}-3-methyl-butyric acid methyl ester | CHEMBL186052
TypeSmall organic molecule
Emp. Form.C38H56N4O8
Mol. Mass.696.8732
SMILESCOC(=O)C(NC(=O)C(NC(=O)[C@H](CC(C)C)C[C@H](O)C(Cc1ccccc1)NC(=O)C(C)NC(=O)OCc1ccccc1)C(C)C)C(C)C