Reaction Details
TargetPoly [ADP-ribose] polymerase 1
LigandBDBM27566
Substrate/Competitorn/a
Meas. Tech.ChEMBL_2170063 (CHEMBL5055122)
IC50 0.600000±n/a nM
Citation Wang, SPLi, YHuang, SHWu, SQGao, LLSun, QLin, QWHuang, LMeng, LQZou, YZhu, QHXu, YG Discovery of Potent and Novel Dual PARP/BRD4 Inhibitors for Efficient Treatment of Pancreatic Cancer. J Med Chem64:17413-17435 (2021) 
 
Poly [ADP-ribose] polymerase 1
Name:Poly [ADP-ribose] polymerase 1
Type:n/a
Mol. Mass.:113114.22
Organism:Homo sapiens (Human)
Description:P09874
Residue:1014
BDBM27566
NameBDBM27566
Synonyms:4-({3-[(4-cyclopropanecarbonylpiperazin-1-yl)carbonyl]-4-fluorophenyl}methyl)-1,2-dihydrophthalazin-1-one Olaparib US10597399, Compound AZD2281 US9255106, AZD2281
TypeSmall organic molecule
Emp. Form.C24H23FN4O3
Mol. Mass.434.4628
SMILESFc1ccc(Cc2n[nH]c(=O)c3ccccc23)cc1C(=O)N1CCN(CC1)C(=O)C1CC1