Reaction Details
TargetB2 bradykinin receptor
LigandBDBM50156448
Substrate/Competitorn/a
Meas. Tech.ChEMBL_303698 (CHEMBL828185)
Ki>10000±n/a nM
Citation Su, DSMarkowitz, MKMurphy, KLWan, BLZrada, MMHarrell, CMO'Malley, SSHess, JFRansom, RWChang, RSWallace, MARaab, CEDean, DCPettibone, DJFreidinger, RMBock, MG Development of an efficient and selective radioligand for bradykinin B1 receptor occupancy studies. Bioorg Med Chem Lett14:6045-8 (2004) 
 
B2 bradykinin receptor
Name:B2 bradykinin receptor
Type:Enzyme Catalytic Domain
Mol. Mass.:44467.17
Organism:Homo sapiens (Human)
Description:B2 BRADYKININ BDKRB2 HUMAN::P30411
Residue:391
BDBM50156448
NameBDBM50156448
Synonyms:CHEMBL185811 | N-{2-[4-(1H-Imidazol-2-yl)-phenyl]-ethyl}-2-[(R)-1-(naphthalene-2-sulfonyl)-3-oxo-1,2,3,4-tetrahydro-quinoxalin-2-yl]-acetamide
TypeSmall organic molecule
Emp. Form.C31H27N5O4S
Mol. Mass.565.642
SMILESO=C(C[C@H]1N(c2ccccc2NC1=O)S(=O)(=O)c1ccc2ccccc2c1)NCCc1ccc(cc1)-c1ncc[nH]1