Reaction Details
TargetB2 bradykinin receptor
LigandBDBM50156452
Substrate/Competitorn/a
Meas. Tech.ChEMBL_303698 (CHEMBL828185)
Ki>10000±n/a nM
Citation Su, DSMarkowitz, MKMurphy, KLWan, BLZrada, MMHarrell, CMO'Malley, SSHess, JFRansom, RWChang, RSWallace, MARaab, CEDean, DCPettibone, DJFreidinger, RMBock, MG Development of an efficient and selective radioligand for bradykinin B1 receptor occupancy studies. Bioorg Med Chem Lett14:6045-8 (2004) 
 
B2 bradykinin receptor
Name:B2 bradykinin receptor
Type:Enzyme Catalytic Domain
Mol. Mass.:44467.17
Organism:Homo sapiens (Human)
Description:B2 BRADYKININ BDKRB2 HUMAN::P30411
Residue:391
BDBM50156452
NameBDBM50156452
Synonyms:2-[(R)-1-(3,4-Dichloro-benzenesulfonyl)-3-oxo-1,2,3,4-tetrahydro-quinoxalin-2-yl]-N-[2-(4-imidazol-1-yl-phenyl)-ethyl]-acetamide | CHEMBL189245
TypeSmall organic molecule
Emp. Form.C27H23Cl2N5O4S
Mol. Mass.584.474
SMILESClc1ccc(cc1Cl)S(=O)(=O)N1[C@H](CC(=O)NCCc2ccc(cc2)-n2ccnc2)C(=O)Nc2ccccc12