Reaction Details
TargetB2 bradykinin receptor
LigandBDBM50156451
Substrate/Competitorn/a
Meas. Tech.ChEMBL_303698 (CHEMBL828185)
Ki>10000±n/a nM
Citation Su, DSMarkowitz, MKMurphy, KLWan, BLZrada, MMHarrell, CMO'Malley, SSHess, JFRansom, RWChang, RSWallace, MARaab, CEDean, DCPettibone, DJFreidinger, RMBock, MG Development of an efficient and selective radioligand for bradykinin B1 receptor occupancy studies. Bioorg Med Chem Lett14:6045-8 (2004) 
 
B2 bradykinin receptor
Name:B2 bradykinin receptor
Type:Enzyme Catalytic Domain
Mol. Mass.:44467.17
Organism:Homo sapiens (Human)
Description:B2 BRADYKININ BDKRB2 HUMAN::P30411
Residue:391
BDBM50156451
NameBDBM50156451
Synonyms:2-[(R)-7-Chloro-1-(naphthalene-2-sulfonyl)-3-oxo-1,2,3,4-tetrahydro-quinoxalin-2-yl]-N-{2-[4-(1-methyl-4,5-dihydro-1H-imidazol-2-yl)-phenyl]-ethyl}-acetamide | CHEMBL185693
TypeSmall organic molecule
Emp. Form.C32H30ClN5O4S
Mol. Mass.616.13
SMILESCN1CCN=C1c1ccc(CCNC(=O)C[C@H]2N(c3cc(Cl)ccc3NC2=O)S(=O)(=O)c2ccc3ccccc3c2)cc1