Reaction Details
TargetTubulin beta chain [1-43]
LigandBDBM50156480
Substrate/Competitorn/a
Meas. Tech.ChEMBL_311631 (CHEMBL833941)
IC50 3500±n/a nM
Citation Kim, SPark, JHKoo, SYKim, JIKim, MHKim, JEJo, KChoi, HGLee, SBJung, SH Novel diarylsulfonylurea derivatives as potent antimitotic agents. Bioorg Med Chem Lett14:6075-8 (2004) 
 
Tubulin beta chain [1-43]
Name:Tubulin beta chain [1-43]
Type:PROTEIN
Mol. Mass.:4652.47
Organism:Leishmania donovani
Description:ChEMBL_311916
Residue:43
BDBM50156480
NameBDBM50156480
Synonyms:(S)-4-Phenyl-1-[1-(2-phenylamino-acetyl)-2,3-dihydro-1H-indole-5-sulfonyl]-imidazolidin-2-one | CHEMBL361893
TypeSmall organic molecule
Emp. Form.C25H24N4O4S
Mol. Mass.476.547
SMILESO=C(CNc1ccccc1)N1CCc2cc(ccc12)S(=O)(=O)N1C[C@@H](NC1=O)c1ccccc1