Reaction Details
TargetTubulin beta chain [1-43]
LigandBDBM50156494
Substrate/Competitorn/a
Meas. Tech.ChEMBL_311631 (CHEMBL833941)
IC50 6000±n/a nM
Citation Kim, SPark, JHKoo, SYKim, JIKim, MHKim, JEJo, KChoi, HGLee, SBJung, SH Novel diarylsulfonylurea derivatives as potent antimitotic agents. Bioorg Med Chem Lett14:6075-8 (2004) 
 
Tubulin beta chain [1-43]
Name:Tubulin beta chain [1-43]
Type:PROTEIN
Mol. Mass.:4652.47
Organism:Leishmania donovani
Description:ChEMBL_311916
Residue:43
BDBM50156494
NameBDBM50156494
Synonyms:CHEMBL187414 | [2-Methyl-4-((S)-2-oxo-4-phenyl-imidazolidine-1-sulfonyl)-phenyl]-carbamic acid ethyl ester
TypeSmall organic molecule
Emp. Form.C19H21N3O5S
Mol. Mass.403.452
SMILESCCOC(=O)Nc1ccc(cc1C)S(=O)(=O)N1C[C@@H](NC1=O)c1ccccc1