Reaction Details
TargetProstaglandin E2 receptor EP4 subtype
LigandBDBM50156552
Substrate/Competitorn/a
Meas. Tech.ChEMBL_429536 (CHEMBL918077)
Ki 0.7±n/a nM
Citation Elworthy, TRBrill, ERChiou, SSChu, FHarris, JRHendricks, RTHuang, JKim, WLach, LKMirzadegan, TYee, CWalker, KA Lactams as EP4 prostanoid receptor agonists. 3. Discovery of N-ethylbenzoic acid 2-pyrrolidinones as subtype selective agents. J Med Chem47:6124-7 (2004) 
 
Prostaglandin E2 receptor EP4 subtype
Name:Prostaglandin E2 receptor EP4 subtype
Type:Enzyme
Mol. Mass.:53134.53
Organism:Homo sapiens (Human)
Description:P35408
Residue:488
BDBM50156552
NameBDBM50156552
Synonyms:4-(2-((R)-2-((S,E)-3-hydroxy-4-(3-(methoxymethyl)phenyl)but-1-enyl)-5-oxopyrrolidin-1-yl)ethyl)benzoic acid | CHEMBL222834
TypeSmall organic molecule
Emp. Form.C25H29NO5
Mol. Mass.423.5015
SMILESCOCc1cccc(C[C@H](O)\C=C\[C@H]2CCC(=O)N2CCc2ccc(cc2)C(O)=O)c1