Reaction Details
TargetKallikrein-1
LigandBDBM50157084
Substrate/Competitorn/a
Meas. Tech.ChEMBL_302558 (CHEMBL839521)
Ki 83±n/a nM
Citation Bruncko, MMcClellan, WJWendt, MDSauer, DRGeyer, ADalton, CRKaminski, MAWeitzberg, MGong, JDellaria, JFMantei, RZhao, XNienaber, VLStewart, KKlinghofer, VBouska, JRockway, TWGiranda, VL Naphthamidine urokinase plasminogen activator inhibitors with improved pharmacokinetic properties. Bioorg Med Chem Lett15:93-8 (2004) 
 
Kallikrein-1
Name:Kallikrein-1
Type:Enzyme
Mol. Mass.:28874.69
Organism:Homo sapiens (Human)
Description:P06870
Residue:262
BDBM50157084
NameBDBM50157084
Synonyms:8-Furan-3-yl-6-styryl-naphthalene-2-carboxamidine | CHEMBL360195
TypeSmall organic molecule
Emp. Form.C23H18N2O
Mol. Mass.338.4018
SMILESNC(=N)c1ccc2cc(\C=C\c3ccccc3)cc(-c3ccoc3)c2c1