Reaction Details
TargetKallikrein-1
LigandBDBM50157093
Substrate/Competitorn/a
Meas. Tech.ChEMBL_302558 (CHEMBL839521)
Ki 295±n/a nM
Citation Bruncko, MMcClellan, WJWendt, MDSauer, DRGeyer, ADalton, CRKaminski, MAWeitzberg, MGong, JDellaria, JFMantei, RZhao, XNienaber, VLStewart, KKlinghofer, VBouska, JRockway, TWGiranda, VL Naphthamidine urokinase plasminogen activator inhibitors with improved pharmacokinetic properties. Bioorg Med Chem Lett15:93-8 (2004) 
 
Kallikrein-1
Name:Kallikrein-1
Type:Enzyme
Mol. Mass.:28874.69
Organism:Homo sapiens (Human)
Description:P06870
Residue:262
BDBM50157093
NameBDBM50157093
Synonyms:6-[2-(1-Cyclohexyl-2-methyl-1,2,3,4-tetrahydro-isoquinolin-7-yl)-cyclopropyl]-naphthalene-2-carboxamidine | CHEMBL182547
TypeSmall organic molecule
Emp. Form.C30H35N3
Mol. Mass.437.619
SMILESCN1CCc2ccc(cc2C1C1CCCCC1)C1CC1c1ccc2cc(ccc2c1)C(N)=N