Reaction Details
TargetKallikrein-1
LigandBDBM50157083
Substrate/Competitorn/a
Meas. Tech.ChEMBL_302558 (CHEMBL839521)
Ki 156±n/a nM
Citation Bruncko, MMcClellan, WJWendt, MDSauer, DRGeyer, ADalton, CRKaminski, MAWeitzberg, MGong, JDellaria, JFMantei, RZhao, XNienaber, VLStewart, KKlinghofer, VBouska, JRockway, TWGiranda, VL Naphthamidine urokinase plasminogen activator inhibitors with improved pharmacokinetic properties. Bioorg Med Chem Lett15:93-8 (2004) 
 
Kallikrein-1
Name:Kallikrein-1
Type:Enzyme
Mol. Mass.:28874.69
Organism:Homo sapiens (Human)
Description:P06870
Residue:262
BDBM50157083
NameBDBM50157083
Synonyms:6-Phenethyl-8-(pyrimidin-2-ylamino)-naphthalene-2-carboxamidine | CHEMBL181595
TypeSmall organic molecule
Emp. Form.C23H21N5
Mol. Mass.367.4463
SMILESNC(=N)c1ccc2cc(CCc3ccccc3)cc(Nc3ncccn3)c2c1