Reaction Details
TargetUrokinase-type plasminogen activator
LigandBDBM50157084
Substrate/Competitorn/a
Meas. Tech.ChEMBL_302922 (CHEMBL830381)
Ki 168±n/a nM
Citation Bruncko, MMcClellan, WJWendt, MDSauer, DRGeyer, ADalton, CRKaminski, MAWeitzberg, MGong, JDellaria, JFMantei, RZhao, XNienaber, VLStewart, KKlinghofer, VBouska, JRockway, TWGiranda, VL Naphthamidine urokinase plasminogen activator inhibitors with improved pharmacokinetic properties. Bioorg Med Chem Lett15:93-8 (2004) 
 
Urokinase-type plasminogen activator
Name:Urokinase-type plasminogen activator
Type:Enzyme
Mol. Mass.:48528.62
Organism:Homo sapiens (Human)
Description:P00749
Residue:431
BDBM50157084
NameBDBM50157084
Synonyms:8-Furan-3-yl-6-styryl-naphthalene-2-carboxamidine | CHEMBL360195
TypeSmall organic molecule
Emp. Form.C23H18N2O
Mol. Mass.338.4018
SMILESNC(=N)c1ccc2cc(\C=C\c3ccccc3)cc(-c3ccoc3)c2c1