Reaction Details
TargetTissue-type plasminogen activator
LigandBDBM50157089
Substrate/Competitorn/a
Meas. Tech.ChEMBL_302869 (CHEMBL876364)
Ki 30783±n/a nM
Citation Bruncko, MMcClellan, WJWendt, MDSauer, DRGeyer, ADalton, CRKaminski, MAWeitzberg, MGong, JDellaria, JFMantei, RZhao, XNienaber, VLStewart, KKlinghofer, VBouska, JRockway, TWGiranda, VL Naphthamidine urokinase plasminogen activator inhibitors with improved pharmacokinetic properties. Bioorg Med Chem Lett15:93-8 (2004) 
 
Tissue-type plasminogen activator
Name:Tissue-type plasminogen activator
Type:Enzyme
Mol. Mass.:62931.08
Organism:Homo sapiens (Human)
Description:n/a
Residue:562
BDBM50157089
NameBDBM50157089
Synonyms:8-Bromo-6-(2-phenyl-cyclopropyl)-naphthalene-2-carboxamidine | CHEMBL181599
TypeSmall organic molecule
Emp. Form.C20H17BrN2
Mol. Mass.365.266
SMILESNC(=N)c1ccc2cc(cc(Br)c2c1)C1CC1c1ccccc1