Reaction Details
TargetUrokinase-type plasminogen activator
LigandBDBM50157094
Substrate/Competitorn/a
Meas. Tech.ChEMBL_302922 (CHEMBL830381)
Ki 10±n/a nM
Citation Bruncko, MMcClellan, WJWendt, MDSauer, DRGeyer, ADalton, CRKaminski, MAWeitzberg, MGong, JDellaria, JFMantei, RZhao, XNienaber, VLStewart, KKlinghofer, VBouska, JRockway, TWGiranda, VL Naphthamidine urokinase plasminogen activator inhibitors with improved pharmacokinetic properties. Bioorg Med Chem Lett15:93-8 (2004) 
 
Urokinase-type plasminogen activator
Name:Urokinase-type plasminogen activator
Type:Enzyme
Mol. Mass.:48528.62
Organism:Homo sapiens (Human)
Description:P00749
Residue:431
BDBM50157094
NameBDBM50157094
Synonyms:8-(Pyrimidin-2-ylamino)-6-((E)-styryl)-naphthalene-2-carboxamidine | CHEMBL362600
TypeSmall organic molecule
Emp. Form.C23H19N5
Mol. Mass.365.4305
SMILESNC(=N)c1ccc2cc(\C=C\c3ccccc3)cc(Nc3ncccn3)c2c1