Reaction Details
TargetPlasminogen
LigandBDBM50147096
Substrate/Competitorn/a
Meas. Tech.ChEMBL_302472 (CHEMBL826337)
Ki 90±n/a nM
Citation Bruncko, MMcClellan, WJWendt, MDSauer, DRGeyer, ADalton, CRKaminski, MAWeitzberg, MGong, JDellaria, JFMantei, RZhao, XNienaber, VLStewart, KKlinghofer, VBouska, JRockway, TWGiranda, VL Naphthamidine urokinase plasminogen activator inhibitors with improved pharmacokinetic properties. Bioorg Med Chem Lett15:93-8 (2004) 
 
Plasminogen
Name:Plasminogen
Type:Enzyme
Mol. Mass.:90579.18
Organism:Homo sapiens (Human)
Description:n/a
Residue:810
BDBM50147096
NameBDBM50147096
Synonyms:6-Carbamimidoyl-4-(pyrimidin-2-ylamino)-naphthalene-2-carboxylic acid phenylamide | CHEMBL104505
TypeSmall organic molecule
Emp. Form.C22H18N6O
Mol. Mass.382.4179
SMILESNC(=N)c1ccc2cc(cc(Nc3ncccn3)c2c1)C(=O)Nc1ccccc1