Reaction Details
TargetUrokinase-type plasminogen activator
LigandBDBM50157097
Substrate/Competitorn/a
Meas. Tech.ChEMBL_302922 (CHEMBL830381)
Ki 142±n/a nM
Citation Bruncko, MMcClellan, WJWendt, MDSauer, DRGeyer, ADalton, CRKaminski, MAWeitzberg, MGong, JDellaria, JFMantei, RZhao, XNienaber, VLStewart, KKlinghofer, VBouska, JRockway, TWGiranda, VL Naphthamidine urokinase plasminogen activator inhibitors with improved pharmacokinetic properties. Bioorg Med Chem Lett15:93-8 (2004) 
 
Urokinase-type plasminogen activator
Name:Urokinase-type plasminogen activator
Type:Enzyme
Mol. Mass.:48528.62
Organism:Homo sapiens (Human)
Description:P00749
Residue:431
BDBM50157097
NameBDBM50157097
Synonyms:6-[2-(1-Phenyl-3,4-dihydro-isoquinolin-7-yl)-cyclopropyl]-naphthalene-2-carboxamidine | CHEMBL182460
TypeSmall organic molecule
Emp. Form.C29H25N3
Mol. Mass.415.5289
SMILESNC(=N)c1ccc2cc(ccc2c1)C1CC1c1ccc2CCN=C(c3ccccc3)c2c1