Reaction Details
TargetTissue-type plasminogen activator
LigandBDBM50157082
Substrate/Competitorn/a
Meas. Tech.ChEMBL_302869 (CHEMBL876364)
Ki 34564.0±n/a nM
Citation Bruncko, MMcClellan, WJWendt, MDSauer, DRGeyer, ADalton, CRKaminski, MAWeitzberg, MGong, JDellaria, JFMantei, RZhao, XNienaber, VLStewart, KKlinghofer, VBouska, JRockway, TWGiranda, VL Naphthamidine urokinase plasminogen activator inhibitors with improved pharmacokinetic properties. Bioorg Med Chem Lett15:93-8 (2004) 
 
Tissue-type plasminogen activator
Name:Tissue-type plasminogen activator
Type:Enzyme
Mol. Mass.:62931.08
Organism:Homo sapiens (Human)
Description:n/a
Residue:562
BDBM50157082
NameBDBM50157082
Synonyms:6-Styryl-naphthalene-2-carboxamidine | CHEMBL185345
TypeSmall organic molecule
Emp. Form.C19H16N2
Mol. Mass.272.3437
SMILESNC(=N)c1ccc2cc(\C=C\c3ccccc3)ccc2c1