Reaction Details
TargetUrokinase-type plasminogen activator
LigandBDBM50147088
Substrate/Competitorn/a
Meas. Tech.ChEMBL_302922 (CHEMBL830381)
Ki 91±n/a nM
Citation Bruncko, MMcClellan, WJWendt, MDSauer, DRGeyer, ADalton, CRKaminski, MAWeitzberg, MGong, JDellaria, JFMantei, RZhao, XNienaber, VLStewart, KKlinghofer, VBouska, JRockway, TWGiranda, VL Naphthamidine urokinase plasminogen activator inhibitors with improved pharmacokinetic properties. Bioorg Med Chem Lett15:93-8 (2004) 
 
Urokinase-type plasminogen activator
Name:Urokinase-type plasminogen activator
Type:Enzyme
Mol. Mass.:48528.62
Organism:Homo sapiens (Human)
Description:P00749
Residue:431
BDBM50147088
NameBDBM50147088
Synonyms:6-Carbamimidoyl-4-furan-3-yl-naphthalene-2-carboxylic acid phenylamide | CHEMBL319047
TypeSmall organic molecule
Emp. Form.C22H17N3O2
Mol. Mass.355.3893
SMILESNC(=N)c1ccc2cc(cc(-c3ccoc3)c2c1)C(=O)Nc1ccccc1