Reaction Details
TargetPlasminogen
LigandBDBM50157082
Substrate/Competitorn/a
Meas. Tech.ChEMBL_302472 (CHEMBL826337)
Ki 1216±n/a nM
Citation Bruncko, MMcClellan, WJWendt, MDSauer, DRGeyer, ADalton, CRKaminski, MAWeitzberg, MGong, JDellaria, JFMantei, RZhao, XNienaber, VLStewart, KKlinghofer, VBouska, JRockway, TWGiranda, VL Naphthamidine urokinase plasminogen activator inhibitors with improved pharmacokinetic properties. Bioorg Med Chem Lett15:93-8 (2004) 
 
Plasminogen
Name:Plasminogen
Type:Enzyme
Mol. Mass.:90579.18
Organism:Homo sapiens (Human)
Description:n/a
Residue:810
BDBM50157082
NameBDBM50157082
Synonyms:6-Styryl-naphthalene-2-carboxamidine | CHEMBL185345
TypeSmall organic molecule
Emp. Form.C19H16N2
Mol. Mass.272.3437
SMILESNC(=N)c1ccc2cc(\C=C\c3ccccc3)ccc2c1