Reaction Details
TargetCruzipain
LigandBDBM50157206
Substrate/Competitorn/a
Meas. Tech.ChEMBL_305484 (CHEMBL830275)
IC50 30±n/a nM
Citation Fujii, NMallari, JPHansell, EJMackey, ZDoyle, PZhou, YMGut, JRosenthal, PJMcKerrow, JHGuy, RK Discovery of potent thiosemicarbazone inhibitors of rhodesain and cruzain. Bioorg Med Chem Lett15:121-3 (2004) 
 
Cruzipain
Name:Cruzipain
Type:Protein
Mol. Mass.:49831.41
Organism:Trypanosoma cruzi
Description:P25779
Residue:467
BDBM50157206
NameBDBM50157206
Synonyms:(1Z)-1-(3,4-dichlorophenyl)-2-phenoxyethan-1-one thiosemicarbazone | CHEMBL182790
TypeSmall organic molecule
Emp. Form.C15H13Cl2N3OS
Mol. Mass.354.254
SMILESNC(=S)NN=C(COc1ccccc1)c1ccc(Cl)c(Cl)c1