Reaction Details
TargetCruzipain
LigandBDBM50157205
Substrate/Competitorn/a
Meas. Tech.ChEMBL_305484 (CHEMBL830275)
IC50 80±n/a nM
Citation Fujii, NMallari, JPHansell, EJMackey, ZDoyle, PZhou, YMGut, JRosenthal, PJMcKerrow, JHGuy, RK Discovery of potent thiosemicarbazone inhibitors of rhodesain and cruzain. Bioorg Med Chem Lett15:121-3 (2004) 
 
Cruzipain
Name:Cruzipain
Type:Protein
Mol. Mass.:49831.41
Organism:Trypanosoma cruzi
Description:P25779
Residue:467
BDBM50157205
NameBDBM50157205
Synonyms:(1E)-1-(3,4-dichlorophenyl)-2-phenylethan-1-one thiosemicarbazone | CHEMBL183767
TypeSmall organic molecule
Emp. Form.C15H13Cl2N3S
Mol. Mass.338.255
SMILESNC(=S)NN=C(Cc1ccccc1)c1ccc(Cl)c(Cl)c1