Reaction Details
TargetCysteine protease
LigandBDBM50114608
Substrate/Competitorn/a
Meas. Tech.ChEMBL_305932 (CHEMBL833479)
IC50 110±n/a nM
Citation Fujii, NMallari, JPHansell, EJMackey, ZDoyle, PZhou, YMGut, JRosenthal, PJMcKerrow, JHGuy, RK Discovery of potent thiosemicarbazone inhibitors of rhodesain and cruzain. Bioorg Med Chem Lett15:121-3 (2004) 
 
Cysteine protease
Name:Cysteine protease
Synonyms:Rhodesain
Type:PROTEIN
Mol. Mass.:48425.78
Organism:Trypanosoma brucei rhodesiense
Description:ChEMBL_619861
Residue:450
BDBM50114608
NameBDBM50114608
TypeSmall organic molecule
Emp. Form.C10H11Cl2N3S
Mol. Mass.276.185
SMILESCCC(=NNC(N)=S)c1ccc(Cl)c(Cl)c1