Reaction Details
TargetEstrogen receptor
LigandBDBM50157500
Substrate/Competitorn/a
Meas. Tech.ChEMBL_429939 (CHEMBL916819)
IC50 40±n/a nM
Citation Steffan, RJMatelan, EAshwell, MAMoore, WJSolvibile, WRTrybulski, EChadwick, CCChippari, SKenney, TEckert, ABorges-Marcucci, LKeith, JCXu, ZMosyak, LHarnish, DC Synthesis and activity of substituted 4-(indazol-3-yl)phenols as pathway-selective estrogen receptor ligands useful in the treatment of rheumatoid arthritis. J Med Chem47:6435-8 (2004) 
 
Estrogen receptor
Name:Estrogen receptor
Type:Protein
Mol. Mass.:66230.44
Organism:Homo sapiens (Human)
Description:P03372
Residue:595
BDBM50157500
NameBDBM50157500
Synonyms:4-[6-hydroxy-1-(4-methylphenyl)-1H-indazol-3-yl]benzene-1,3-diol | CHEMBL426897
TypeSmall organic molecule
Emp. Form.C20H16N2O3
Mol. Mass.332.3526
SMILESCc1ccc(cc1)-n1nc(-c2ccc(O)cc2O)c2ccc(O)cc12