Reaction Details
TargetEstrogen receptor
LigandBDBM50157507
Substrate/Competitorn/a
Meas. Tech.ChEMBL_429939 (CHEMBL916819)
IC50 59±n/a nM
Citation Steffan, RJMatelan, EAshwell, MAMoore, WJSolvibile, WRTrybulski, EChadwick, CCChippari, SKenney, TEckert, ABorges-Marcucci, LKeith, JCXu, ZMosyak, LHarnish, DC Synthesis and activity of substituted 4-(indazol-3-yl)phenols as pathway-selective estrogen receptor ligands useful in the treatment of rheumatoid arthritis. J Med Chem47:6435-8 (2004) 
 
Estrogen receptor
Name:Estrogen receptor
Type:Protein
Mol. Mass.:66230.44
Organism:Homo sapiens (Human)
Description:P03372
Residue:595
BDBM50157507
NameBDBM50157507
Synonyms:4-[1-allyl-7-(trifluoromethyl)-1H-indazol-3-yl]-3-methylphenol | CHEMBL222522
TypeSmall organic molecule
Emp. Form.C18H15F3N2O
Mol. Mass.332.3197
SMILESCc1cc(O)ccc1-c1nn(CC=C)c2c(cccc12)C(F)(F)F