Reaction Details
TargetB1 bradykinin receptor
LigandBDBM50157514
Substrate/Competitorn/a
Meas. Tech.ChEMBL_429981 (CHEMBL917711)
Ki 12±n/a nM
Citation Kuduk, SDNg, CFeng, DMWai, JMChang, RSHarrell, CMMurphy, KLRansom, RWReiss, DIvarsson, MMason, GBoyce, STang, CPrueksaritanont, TFreidinger, RMPettibone, DJBock, MG 2,3-diaminopyridine bradykinin B1 receptor antagonists. J Med Chem47:6439-42 (2004) 
 
B1 bradykinin receptor
Name:B1 bradykinin receptor
Type:Enzyme Catalytic Domain
Mol. Mass.:38389.97
Organism:RAT
Description:B1 BRADYKININ BDKRB1 RAT::P97583
Residue:337
BDBM50157514
NameBDBM50157514
Synonyms:CHEMBL221984 | N-(4-chloro-2-{(R)-1-[3'-fluoro-2'-(1-methyl-1H-tetrazol-5-yl)-biphenyl-4-yl]-ethylamino}-pyridin-3-yl)-2-cyano-acetamide
TypeSmall organic molecule
Emp. Form.C24H20ClFN8O
Mol. Mass.490.92
SMILESC[C@@H](Nc1nccc(Cl)c1NC(=O)CC#N)c1ccc(cc1)-c1cccc(F)c1-c1nnnn1C