Reaction Details
TargetB1 bradykinin receptor
LigandBDBM50157515
Substrate/Competitorn/a
Meas. Tech.ChEMBL_429982 (CHEMBL917712)
Ki 0.69±n/a nM
Citation Kuduk, SDNg, CFeng, DMWai, JMChang, RSHarrell, CMMurphy, KLRansom, RWReiss, DIvarsson, MMason, GBoyce, STang, CPrueksaritanont, TFreidinger, RMPettibone, DJBock, MG 2,3-diaminopyridine bradykinin B1 receptor antagonists. J Med Chem47:6439-42 (2004) 
 
B1 bradykinin receptor
Name:B1 bradykinin receptor
Type:PROTEIN
Mol. Mass.:39519.62
Organism:Oryctolagus cuniculus
Description:ChEMBL_796432
Residue:352
BDBM50157515
NameBDBM50157515
Synonyms:4'-{(R)-1-[4-chloro-3-(2-cyano-acetylamino)-pyridin-2-ylamino]-ethyl}-3-fluoro-biphenyl-2-carboxylic acid methyl ester | CHEMBL225607
TypeSmall organic molecule
Emp. Form.C24H20ClFN4O3
Mol. Mass.466.892
SMILESCOC(=O)c1c(F)cccc1-c1ccc(cc1)[C@@H](C)Nc1nccc(Cl)c1NC(=O)CC#N