Reaction Details
TargetB1 bradykinin receptor
LigandBDBM50157509
Substrate/Competitorn/a
Meas. Tech.ChEMBL_429973 (CHEMBL917703)
Ki 0.5±n/a nM
Citation Kuduk, SDNg, CFeng, DMWai, JMChang, RSHarrell, CMMurphy, KLRansom, RWReiss, DIvarsson, MMason, GBoyce, STang, CPrueksaritanont, TFreidinger, RMPettibone, DJBock, MG 2,3-diaminopyridine bradykinin B1 receptor antagonists. J Med Chem47:6439-42 (2004) 
 
B1 bradykinin receptor
Name:B1 bradykinin receptor
Type:Enzyme
Mol. Mass.:40508.87
Organism:Homo sapiens (Human)
Description:P46663
Residue:353
BDBM50157509
NameBDBM50157509
Synonyms:CHEMBL222038 | N-(4-chloro-2-{(R)-1-[3'-fluoro-2'-(3-methyl-[1,2,4]oxadiazol-5-yl)-biphenyl-4-yl]-ethylamino}-pyridin-3-yl)-2-cyano-acetamide
TypeSmall organic molecule
Emp. Form.C25H20ClFN6O2
Mol. Mass.490.917
SMILESC[C@@H](Nc1nccc(Cl)c1NC(=O)CC#N)c1ccc(cc1)-c1cccc(F)c1-c1nc(C)no1