Reaction Details
TargetB1 bradykinin receptor
LigandBDBM50157518
Substrate/Competitorn/a
Meas. Tech.ChEMBL_429973 (CHEMBL917703)
Ki 0.8±n/a nM
Citation Kuduk, SDNg, CFeng, DMWai, JMChang, RSHarrell, CMMurphy, KLRansom, RWReiss, DIvarsson, MMason, GBoyce, STang, CPrueksaritanont, TFreidinger, RMPettibone, DJBock, MG 2,3-diaminopyridine bradykinin B1 receptor antagonists. J Med Chem47:6439-42 (2004) 
 
B1 bradykinin receptor
Name:B1 bradykinin receptor
Type:Enzyme
Mol. Mass.:40508.87
Organism:Homo sapiens (Human)
Description:P46663
Residue:353
BDBM50157518
NameBDBM50157518
Synonyms:5-chloro-4'-{(R)-1-[4-chloro-3-(2-cyano-acetylamino)-pyridin-2-ylamino]-ethyl}-biphenyl-2-carboxylic acid methyl ester | CHEMBL375288
TypeSmall organic molecule
Emp. Form.C24H20Cl2N4O3
Mol. Mass.483.347
SMILESCOC(=O)c1ccc(Cl)cc1-c1ccc(cc1)[C@@H](C)Nc1nccc(Cl)c1NC(=O)CC#N