Reaction Details
TargetB1 bradykinin receptor
LigandBDBM50157516
Substrate/Competitorn/a
Meas. Tech.ChEMBL_429974 (CHEMBL917704)
IC50 1.4±n/a nM
Citation Kuduk, SDNg, CFeng, DMWai, JMChang, RSHarrell, CMMurphy, KLRansom, RWReiss, DIvarsson, MMason, GBoyce, STang, CPrueksaritanont, TFreidinger, RMPettibone, DJBock, MG 2,3-diaminopyridine bradykinin B1 receptor antagonists. J Med Chem47:6439-42 (2004) 
 
B1 bradykinin receptor
Name:B1 bradykinin receptor
Type:Enzyme
Mol. Mass.:40508.87
Organism:Homo sapiens (Human)
Description:P46663
Residue:353
BDBM50157516
NameBDBM50157516
Synonyms:4'-{(R)-1-[3-(2-cyano-acetylamino)-4-methyl-pyridin-2-ylamino]-ethyl}-5-methyl-biphenyl-2-carboxylic acid methyl ester | CHEMBL225133
TypeSmall organic molecule
Emp. Form.C26H26N4O3
Mol. Mass.442.5096
SMILESCOC(=O)c1ccc(C)cc1-c1ccc(cc1)[C@@H](C)Nc1nccc(C)c1NC(=O)CC#N